BDBM50000196 CHEMBL142310
SMILES C(Oc1ccccc1-c1ccncn1)C1=NCCN1
InChI Key InChIKey=XETSZHAOODKPNL-UHFFFAOYSA-N
Data  3 EC50
  Tab Delimited (TSV)   2D SDfile   Computed 3D by Vconf -m prep SDfile
Find this compound or compounds like it in BindingDB:
Activity Spreadsheet -- Enzyme Inhibition Constant Data from BindingDB
Found 1 hit for monomerid = 50000196
TargetAlpha-1B adrenergic receptor(Homo sapiens (Human))
Glaxosmithkline
Curated by ChEMBL
LigandPNGBDBM50000196(CHEMBL142310)
Affinity DataEC50: <1.00E+5nM. Assay description: Activation of recombinant human adrenergic, alpha-1B receptor expressed in rat-1 fibroblasts determined via calcium mobilization through Gq coupled P...Checked by Author
In DepthDetails ArticlePubMed